Check Point SSL Network Extender – problem z połączeniem

Jesteś nowy na forum? Przeczytaj ...

Home Fora Forum wsparcia Oprogramowanie Check Point SSL Network Extender – problem z połączeniem

Ten wątek zawiera 1 odpowiedź, ma 1 uczestnika, ostatnio zmodyfikowany przez  rekja 4 miesięcy, 2 tygodni temu.

Oglądasz 2 posty - 1 do 2 (z 2 ogółem)
  • Autor
    Posty
  • #8731

    rekja
    Forumowicz

    Witam serdecznie

    Kilka tygodni temu przesiadłem się z Debiana na Manjaro i3 64bit i próbuję odtworzyć funkcjonalność, którą przez 6 lat wypracowałem na debianie. Jedne sprawy idą łatwiej inne trudniej ale od kilku dni męczę się z połączeniem do serwera, który wykorzystuje Check Point SSL Network Extender.

    Najpierw próby z snx niestety problemy z biblioteką lib32-libstdc++5.
    Później próby z wykorzystaniem openjdk, icedtea i firefox bez rezultatu.
    Zdesperowany już tym wszystkim chciałem stawiać jakiegoś windowsa na VM.

    Przewertowałem setki stron w poszukiwaniu działającego rozwiązania i niestety ciągle są problemy. Ma ktoś jakiś sprawdzony sposób na rozwiązanie mojego problemu?

    Pozdrawiam

    #8793

    rekja
    Forumowicz

    Ciągle walczę z snx i biblioteką lib32-libstdc++5.

    w końcowym etapie budowania otrzymuję komunikat błędu, ma ktoś pomysł na rozwiązanie tego problemu?

    make[3]: Wejście do katalogu '/var/tmp/pamac-build-user/lib32-libstdc++5/src/gcc-build/gcc'
    make[3]: Opuszczenie katalogu '/var/tmp/pamac-build-user/lib32-libstdc++5/src/gcc-build/gcc'
    /var/tmp/pamac-build-user/lib32-libstdc++5/src/gcc-build/gcc/xgcc -B/var/tmp/pamac-build-user/lib32-libstdc++5/src/gcc-build/gcc/ -B/usr/x86_64-unknown-linux-gnu/bin/ -B/usr/x86_64-unknown-linux-gnu/lib/ -isystem /usr/x86_64-unknown-linux-gnu/include -O2  -DIN_GCC    -W -Wall -Wwrite-strings -Wstrict-prototypes -Wmissing-prototypes -isystem ./include  -fPIC -g -DHAVE_GTHR_DEFAULT -DIN_LIBGCC2 -D__GCC_FLOAT_NOT_NEEDED  -shared -nodefaultlibs -Wl,--soname=libgcc_s.so.1 -Wl,--version-script=libgcc/./libgcc.map -o libgcc_s.so.1   libgcc/./_muldi3.o libgcc/./_negdi2.o libgcc/./_lshrdi3.o libgcc/./_ashldi3.o libgcc/./_ashrdi3.o libgcc/./_ffsdi2.o libgcc/./_clz.o libgcc/./_cmpdi2.o libgcc/./_ucmpdi2.o libgcc/./_floatdidf.o libgcc/./_floatdisf.o libgcc/./_fixunsdfsi.o libgcc/./_fixunssfsi.o libgcc/./_fixunsdfdi.o libgcc/./_fixdfdi.o libgcc/./_fixunssfdi.o libgcc/./_fixsfdi.o libgcc/./_fixxfdi.o libgcc/./_fixunsxfdi.o libgcc/./_floatdixf.o libgcc/./_fixunsxfsi.o libgcc/./_fixtfdi.o libgcc/./_fixunstfdi.o libgcc/./_floatditf.o libgcc/./_clear_cache.o libgcc/./_trampoline.o libgcc/./__main.o libgcc/./_exit.o libgcc/./_absvsi2.o libgcc/./_absvdi2.o libgcc/./_addvsi3.o libgcc/./_addvdi3.o libgcc/./_subvsi3.o libgcc/./_subvdi3.o libgcc/./_mulvsi3.o libgcc/./_mulvdi3.o libgcc/./_negvsi2.o libgcc/./_negvdi2.o libgcc/./_ctors.o libgcc/./_divdi3.o libgcc/./_moddi3.o libgcc/./_udivdi3.o libgcc/./_umoddi3.o libgcc/./_udiv_w_sdiv.o libgcc/./_udivmoddi4.o  libgcc/./unwind-dw2.o libgcc/./unwind-dw2-fde-glibc.o libgcc/./unwind-sjlj.o libgcc/./unwind-c.o -lc && rm -f libgcc_s.so && ln -s libgcc_s.so.1 libgcc_s.so
    /usr/bin/ld: skipping incompatible /usr/lib32/libc.so when searching for -lc
    /usr/bin/ld: skipping incompatible /usr/lib32/libc.a when searching for -lc
    /usr/bin/ld: i386 architecture of input file 
    /usr/lib32/crti.o' is incompatible with i386:x86-64 output
    /usr/bin/ld: i386 architecture of input file 
    /usr/lib32/crtn.o' is incompatible with i386:x86-64 output
    collect2: ld returned 1 exit status
    make[2]: *** [libgcc.mk:339: libgcc_s.so] Błąd 1
    make[2]: Opuszczenie katalogu '/var/tmp/pamac-build-user/lib32-libstdc++5/src/gcc-build/gcc'
    make[1]: *** [Makefile:1491: stmp-multilib] Błąd 2
    make[1]: Opuszczenie katalogu '/var/tmp/pamac-build-user/lib32-libstdc++5/src/gcc-build/gcc'
    make: *** [Makefile:1546: all-gcc] Błąd 2
    ==> BŁĄD: Wystąpił błąd w build().
        Przerywam...
Oglądasz 2 posty - 1 do 2 (z 2 ogółem)

Musisz być zalogowany aby odpowiedzieć w tym wątku.